{"text_format":"1","workbook":"xlsx","n_sheets":12,"sheets":["8.1","8.2-8.3","8.4","8.5","8.6","8.8","8.9","8.10","8.12","8.13-8.14","8.16-8.18","US Regions"],"not_rendered":{"charts":24,"images":1,"macros":0,"external_links":0,"defined_names":0,"comments":0,"pivot_tables":0},"unopened":[],"bounds":{"document_bytes":16777216,"sheet_cells":100000,"rows_first":2000,"rows_last":500,"rows_between":2000,"halvings":0,"cell_chars":16384,"cell_head_chars":4096},"cells_cut":0,"cells_raw":0,"read":"whole","date_system":"1900"}

{"sheet":"8.1","index":0,"n_rows":69,"n_cols":18,"rows_kept":69,"cut":false,"hidden":false,"merged":[[5,5,5,6],[3,7,3,8],[4,7,4,8],[2,0,2,8],[65,0,65,8],[5,7,5,8],[3,3,4,6],[5,1,5,2],[3,1,3,2],[64,0,64,8],[4,1,4,2],[5,3,5,4]]}
["Table with row headings in column A and column headings in rows 5 to 10."]
["Percentage of People in Poverty by State Using 2- and 3-Year Averages:  2010-2011 and 2012-2013",null,null,null,null,null,null,null,null,null,"Get the data:",null,"page:","https://goo.gl/NVHjAn",null,null,"XLS:","https://goo.gl/RlQyUf"]
["(People as of March of the following year.  For information on confidentiality protection, sampling error, nonsampling error, and definitions, see see ftp://ftp2.census.gov/programs-surveys/cps/techdocs/cpsmar14.pdf)"]
[null,null,null,"2-year average",null,null,null,"Change in percentage points"]
[null,"3-year average",null,null,null,null,null,"(2012-2013 average less"]
["State","2011-20131",null,"2010–2011",null,"2012–2013",null,"2010-2011 average)3",null,null,null,"PERCENTAGE OF PEOPLE IN POVERTY "]
[null,null,"90 percent",null,"90 percent",null,"90 percent",null,"90 percent",null,null,"UNITED STATES",null,null,null,null,"MARYLAND"]
[null,null,"confidence",null,"confidence",null,"confidence",null,"confidence"]
[null,"Percentage","interval2 (+/-)","Percentage","interval2 (+/-)","Percentage","interval2 (+/-)","Percentage","interval2 (+/-)"]
[]
{"$rows_left_out":60}
{"sheet":"8.2-8.3","index":1,"n_rows":59,"n_cols":82,"rows_kept":59,"cut":false,"hidden":false,"merged":[]}
[null,null,null,null,null,null,null,null,null,"Item","Expenditure",null,"Horizontal reference lines"]
[]
[]
[null,null,null,null,null,null,null,null,null,"Food",6665,null,6665,450,17377,1674,9104,3919,2560,602,101,1143,315,683,1790,5551]
[null,null,null,null,null,null,null,null,null,"Alcoholic beverages",450,null,6665,450,17377,1674,9104,3919,2560,602,101,1143,315,683,1790,5551]
[null,null,null,null,null,null,null,null,null,"Housing",17377,null,{"$f":"NA()","v":{"$error":"#N/A"}},450,17377,1674,9104,3919,2560,602,101,1143,315,683,1790,5551]
[null,null,null,null,null,null,null,null,null,"Apparel and services",1674,null,{"$f":"NA()","v":{"$error":"#N/A"}},{"$f":"NA()","v":{"$error":"#N/A"}},17377,1674,9104,3919,2560,602,101,1143,315,683,1790,5551]
[null,"ANNUAL MEAN EXPENDITURE",null,null,null,null,null,null,null,"Transportation",9104,null,{"$f":"NA()","v":{"$error":"#N/A"}},{"$f":"NA()","v":{"$error":"#N/A"}},{"$f":"NA()","v":{"$error":"#N/A"}},1674,9104,3919,2560,602,101,1143,315,683,1790,5551]
[null,"Consumer Expenditure Survey, 3rd quarter 2013 through 2nd quarter 2014",null,null,null,null,null,null,null,"Healthcare",3919,null,{"$f":"NA()","v":{"$error":"#N/A"}},{"$f":"NA()","v":{"$error":"#N/A"}},{"$f":"NA()","v":{"$error":"#N/A"}},{"$f":"NA()","v":{"$error":"#N/A"}},9104,3919,2560,602,101,1143,315,683,1790,5551]
[null,null,null,null,null,null,null,null,null,"Entertainment",2560,null,{"$f":"NA()","v":{"$error":"#N/A"}},{"$f":"NA()","v":{"$error":"#N/A"}},{"$f":"NA()","v":{"$error":"#N/A"}},{"$f":"NA()","v":{"$error":"#N/A"}},{"$f":"NA()","v":{"$error":"#N/A"}},3919,2560,602,101,1143,315,683,1790,5551]
{"$rows_left_out":50}
{"sheet":"8.4","index":2,"n_rows":69,"n_cols":17,"rows_kept":69,"cut":false,"hidden":false,"merged":[[65,0,65,8],[2,0,2,8],[3,1,3,2],[3,3,4,6],[3,7,3,8],[4,1,4,2],[4,7,4,8],[5,1,5,2],[5,3,5,4],[5,5,5,6],[5,7,5,8],[64,0,64,8]]}
["Table with row headings in column A and column headings in rows 5 to 10."]
["Percentage of People in Poverty by State Using 2- and 3-Year Averages:  2010-2011 and 2012-2013"]
["(People as of March of the following year.  For information on confidentiality protection, sampling error, nonsampling error, and definitions, see see ftp://ftp2.census.gov/programs-surveys/cps/techdocs/cpsmar14.pdf)"]
[null,null,null,"2-year average",null,null,null,"Change in percentage points"]
[null,"3-year average",null,null,null,null,null,"(2012-2013 average less"]
["State","2011-20131",null,"2010-2011",null,"2012-2013",null,"2010-2011 average)3"]
[null,null,"90 percent",null,"90 percent",null,"90 percent",null,"90 percent"]
[null,null,"confidence",null,"confidence",null,"confidence",null,"confidence",null,"Series for the middle chart"]
[null,"Percentage","interval2 (+/-)","Percentage","interval2 (+/-)","Percentage","interval2 (+/-)","Percentage","interval2 (+/-)","x-label"]
[null,null,null,null,null,null,null,null,null,null,"Northeast","Midwest","South","West",null,null,"PERCENTAGE OF PEOPLE IN POVERTY BY STATE, 2012–2013"]
{"$rows_left_out":60}
{"sheet":"8.5","index":3,"n_rows":56,"n_cols":28,"rows_kept":56,"cut":false,"hidden":false,"merged":[]}
[]
[]
[null,null,null,null,null,null,null,null,null,null,null,null,"Alphanumeric"]
["State or Region",2010,null,null,null,null,null,null,null,null,null,null,null,null,null,null,null,"Geo",null,null,null,null,null,null,"Rank"]
[null,"Population",null,null,"Area",null,null,null,null,"Alpha",null,"Population","Density"]
["Alaska",710231,1.2,{"$f":"VLOOKUP(A6,'8.4'!$A$12:$J$62,10,FALSE)","v":"AK"},570640.94999999995,{"$f":"TRIM(MID(VLOOKUP(A6,'US Regions'!$B$23:$D$73,3,FALSE),13,500))","v":"Pacific"},{"$f":"B6/E6","v":1.2446197560830503},0,null,"Central","West South Central",36346202,{"$f":"L6/SUMIF($F$6:$F$56,K6,$E$6:$E$56)","v":85.507194517858537},"W-S",{"$f":"TRIM(Q6&\" \"&P6)","v":"Pacific"}," ","Pacific",{"$f":"VLOOKUP(Q6,$K$6:$M$14,3,FALSE)","v":55.714133376748869},593.20000000000005,"Pac",null," ","Mountain",22065451,{"$f":"VLOOKUP(W6,$K$6:$M$14,3,FALSE)","v":25.784415051863771},"Mountain ",{"$f":"VLOOKUP(W6,$Q$6:$T$14,4,FALSE)","v":"Mnt"},{"$f":"TRIM(W6&\" \"&V6)","v":"Mountain"}]
["Wyoming",563626,5.8,{"$f":"VLOOKUP(A7,'8.4'!$A$12:$J$62,10,FALSE)","v":"WY"},97093.14,{"$f":"TRIM(MID(VLOOKUP(A7,'US Regions'!$B$23:$D$73,3,FALSE),13,500))","v":"Mountain"},5.8050033194930144,1,null,"Central","West North Central",20505437,40.395244017927745,"W-N",{"$f":"TRIM(Q7&\" \"&P7)","v":"Mountain"}," ","Mountain",25.784415051863771,211.6,"Mnt",null,"Central","West North Central",20505437,40.395244017927745,{"$f":"W7&\" \"&V7","v":"West North Central Central"},"W-N","West North Central Central"]
["Montana",989415,6.8,{"$f":"VLOOKUP(A8,'8.4'!$A$12:$J$62,10,FALSE)","v":"MT"},145545.79999999999,{"$f":"TRIM(MID(VLOOKUP(A8,'US Regions'!$B$23:$D$73,3,FALSE),13,500))","v":"Mountain"},6.7979632528042728,2,null,"Atlantic ","South Atlantic",59777037,225.52096964185623,"S","West North Central Central","Central","West North Central",40.395244017927745,287.29999999999995,"W-N",null," ","Pacific",49880102,55.714133376748869,"Pacific ","Pac","Pacific"]
["North Dakota",672591,9.6999999999999993,{"$f":"VLOOKUP(A9,'8.4'!$A$12:$J$62,10,FALSE)","v":"ND"},69000.800000000003,{"$f":"TRIM(MID(VLOOKUP(A9,'US Regions'!$B$23:$D$73,3,FALSE),13,500))","v":"West North Central"},9.7475826367230525,3,null," ","Pacific",49880102,55.714133376748869,"Pac","West South Central Central","Central","West South Central",85.507194517858537,311.90000000000003,"W-S",null,"Central","West South Central",36346202,85.507194517858537,{"$f":"W9&\" \"&V9","v":"West South Central Central"},"W-S","West South Central Central"]
["South Dakota",814180,10.7,{"$f":"VLOOKUP(A10,'8.4'!$A$12:$J$62,10,FALSE)","v":"SD"},75811,{"$f":"TRIM(MID(VLOOKUP(A10,'US Regions'!$B$23:$D$73,3,FALSE),13,500))","v":"West North Central"},10.739602432364697,4,null,"England","New England",14444865,230.42303160741227,"N.Eng","East North Central Central","Central","East North Central",191.11197858333489,974.2,"E-N",null,"Central","East South Central",18432505,103.38505548044689,"East South Central Central","E-S","East South Central Central"]
{"$rows_left_out":47}
{"sheet":"8.6","index":4,"n_rows":149,"n_cols":18,"rows_kept":149,"cut":false,"hidden":false,"merged":[]}
["GDP and main components - volumes [nama_gdp_k]",null,null,null,"Percentage change over previous period",null,"Get the data:","http://goo.gl/ad4wQh"]
[null,null,null,null,"Gross domestic product at market prices"]
["Last update",null,null,null,"2015-06-29T14:20:21",null,null,null,null,"UNIT"]
["Extracted on",null,null,null,"2015-08-31T17:28:37.683",null,null,null,null,"INDIC_NA"]
["Source of data",null,null,null,"Eurostat"]
[]
["UNIT",null,null,null,"Million euro, chain-linked volumes, reference year 2005 (at 2005 exchange rates)"]
["INDIC_NA",null,null,null,"Gross domestic product at market prices"]
[]
["GEO/TIME",null,null,null,"2000","2001","2002","2003","2004","2005","WE SPEND MUCH MORE ON TRANSPORTATION THAN ON FOOD. OR MAYBE NOT?","2007","2008","2009","2010","2011","2012","2013"]
{"$rows_left_out":140}
{"sheet":"8.8","index":5,"n_rows":38,"n_cols":20,"rows_kept":38,"cut":false,"hidden":false,"merged":[]}
["GDP and main components - Current prices [nama_gdp_c]"]
[]
["Last update","2014-09-12T20:15:27"]
["Extracted on","2014-09-13T10:37:36.367"]
["Source of data","Eurostat"]
[]
["UNIT","Million euro"]
["INDIC_NA","Gross domestic product at market prices"]
[]
["Get the data:",null,"http://goo.gl/o8uaRY"]
{"$rows_left_out":29}
{"sheet":"8.9","index":6,"n_rows":39,"n_cols":22,"rows_kept":39,"cut":false,"hidden":false,"merged":[]}
["GDP and main components - Price indices [nama_gdp_p]"]
[]
["Last update","2014-09-08T20:15:17"]
["Extracted on","2014-09-13T10:44:29.306"]
["Source of data","Eurostat"]
[null,"Change over previous period, based on 2005=100 and the euro"]
["UNIT","Price index - percentage change over previous period, based on 2005=100 and the euro"]
["INDIC_NA","Gross domestic product at market prices"]
[]
["Get the data:",null,"http://goo.gl/zJ0pue"]
{"$rows_left_out":30}
{"sheet":"8.10","index":7,"n_rows":48,"n_cols":22,"rows_kept":48,"cut":false,"hidden":false,"merged":[]}
["Country","United States of America"]
["Notes"]
[]
[null,"Base values",null,null,null,null,null,null,"Percentages",null,null,null,null,null,null,null,"Folded axis"]
[]
[null,"Male",null,null,"Female",null,null,null,"Male",null,null,"Female",null,null,null,null,"Male",null,null,"Female"]
["Year",1960,2010,2100,1960,2010,2100,null,1960,2010,null,1960,2010,null,null,null,1960,2010,2100,1960,2010,2100]
["00-04",10582.308000000001,10292.737999999999,12421.134,10161.953,9885.1229999999996,11854.909,null,{"$f":"-B8/SUM(B$8:B$28)","v":-0.11462547886454671},{"$f":"-C8/SUM(C$8:C$28)","v":-6.7144790888622435E-2},{"$f":"-D8/SUM(D$8:D$28)","v":-5.5006867857307851E-2},{"$f":"E8/SUM(E$8:E$28)","v":0.10827198487364545},{"$f":"F8/SUM(F$8:F$28)","v":6.3129644509420671E-2},{"$f":"G8/SUM(G$8:G$28)","v":5.2788378826385325E-2},0,null,{"$f":"ABS(I8)","v":0.11462547886454671},{"$f":"ABS(J8)","v":6.7144790888622435E-2},{"$f":"D8/SUM(D$8:D$28)","v":5.5006867857307851E-2},{"$f":"ABS(L8)","v":0.10827198487364545},{"$f":"ABS(M8)","v":6.3129644509420671E-2},{"$f":"G8/SUM(G$8:G$28)","v":5.2788378826385325E-2}]
["05-09",9839.482,10373.171,12522.746999999999,9455.89,9948.8259999999991,11961.02,null,-0.10657933373599481,-6.7669496459243639E-2,-5.5456860012902065E-2,0.10074913543162965,6.3536472805253055E-2,5.3260877406142167E-2,5,null,{"$f":"ABS(I9)","v":0.10657933373599481},{"$f":"ABS(J9)","v":6.7669496459243639E-2},5.5456860012902065E-2,0.10074913543162965,6.3536472805253055E-2,5.3260877406142167E-2]
["10-14",8846.0910000000003,10625.965,12650.291999999999,8462.1550000000007,10085.42,12095.145,null,-9.5819117810061555E-2,-6.9318600931532595E-2,-5.6021691771488705E-2,9.0161243430120511E-2,6.4408806984819655E-2,5.3858118710152933E-2,10,null,9.5819117810061555E-2,6.9318600931532595E-2,5.6021691771488705E-2,9.0161243430120511E-2,6.4408806984819655E-2,5.3858118710152933E-2]
{"$rows_left_out":39}
{"sheet":"8.12","index":8,"n_rows":59,"n_cols":12,"rows_kept":59,"cut":false,"hidden":false,"merged":[]}
["State or Region",2010,null,null,null,null,null,null,"Series for labels"]
[null,"Population","Density","StateCode","Area","Region","Density","Lollipop","Y","X"]
["Alaska",710231,1.2,{"$f":"VLOOKUP(A3,'8.4'!$A$12:$J$62,10,FALSE)","v":"AK"},570640.94999999995,{"$f":"TRIM(MID(VLOOKUP(A3,'US Regions'!$B$23:$D$73,3,FALSE),13,500))","v":"Pacific"},{"$f":"B3/E3","v":1.2446197560830503},{"$f":"NA()","v":{"$error":"#N/A"}},0,1250,null,"POPULATION DENSITY PER STATE, 2010"]
["Wyoming",563626,5.8,{"$f":"VLOOKUP(A4,'8.4'!$A$12:$J$62,10,FALSE)","v":"WY"},97093.14,{"$f":"TRIM(MID(VLOOKUP(A4,'US Regions'!$B$23:$D$73,3,FALSE),13,500))","v":"Mountain"},5.8050033194930144,{"$f":"NA()","v":{"$error":"#N/A"}},1,1250]
["Montana",989415,6.8,{"$f":"VLOOKUP(A5,'8.4'!$A$12:$J$62,10,FALSE)","v":"MT"},145545.79999999999,{"$f":"TRIM(MID(VLOOKUP(A5,'US Regions'!$B$23:$D$73,3,FALSE),13,500))","v":"Mountain"},6.7979632528042728,{"$f":"NA()","v":{"$error":"#N/A"}},2,1250]
["North Dakota",672591,9.6999999999999993,{"$f":"VLOOKUP(A6,'8.4'!$A$12:$J$62,10,FALSE)","v":"ND"},69000.800000000003,{"$f":"TRIM(MID(VLOOKUP(A6,'US Regions'!$B$23:$D$73,3,FALSE),13,500))","v":"West North Central"},9.7475826367230525,{"$f":"NA()","v":{"$error":"#N/A"}},3,1250]
["South Dakota",814180,10.7,{"$f":"VLOOKUP(A7,'8.4'!$A$12:$J$62,10,FALSE)","v":"SD"},75811,{"$f":"TRIM(MID(VLOOKUP(A7,'US Regions'!$B$23:$D$73,3,FALSE),13,500))","v":"West North Central"},10.739602432364697,{"$f":"NA()","v":{"$error":"#N/A"}},4,1250]
["New Mexico",2059179,17,{"$f":"VLOOKUP(A8,'8.4'!$A$12:$J$62,10,FALSE)","v":"NM"},121298.15,{"$f":"TRIM(MID(VLOOKUP(A8,'US Regions'!$B$23:$D$73,3,FALSE),13,500))","v":"Mountain"},16.976178119781711,{"$f":"NA()","v":{"$error":"#N/A"}},5,1250]
["Idaho",1567582,19,{"$f":"VLOOKUP(A9,'8.4'!$A$12:$J$62,10,FALSE)","v":"ID"},82643.12,{"$f":"TRIM(MID(VLOOKUP(A9,'US Regions'!$B$23:$D$73,3,FALSE),13,500))","v":"Mountain"},18.96808832967584,{"$f":"NA()","v":{"$error":"#N/A"}},6,1250]
["Nebraska",1826341,23.8,{"$f":"VLOOKUP(A10,'8.4'!$A$12:$J$62,10,FALSE)","v":"NE"},76824.17,{"$f":"TRIM(MID(VLOOKUP(A10,'US Regions'!$B$23:$D$73,3,FALSE),13,500))","v":"West North Central"},23.773000085780296,{"$f":"NA()","v":{"$error":"#N/A"}},7,1250]
{"$rows_left_out":50}
{"sheet":"8.13-8.14","index":9,"n_rows":801,"n_cols":52,"rows_kept":801,"cut":false,"hidden":false,"merged":[[0,0,0,6],[789,0,789,6],[790,0,790,6],[794,0,794,6]]}
["Table 1101. Quintiles of income before taxes: Annual expenditure means, shares, standard errors, and coefficient of variation, Consumer Expenditure Survey, 3rd quarter 2013 through 2nd quarter 2014",null,null,null,null,null,null,null,"Get the data (PDF):",null,null,"http://goo.gl/6PW6vT"]
[null,null,null,null,null,null,null,null,null,null,null,null,null,null,null,null,null,null,null,null,null,null,null,null,"WEIGHT OF MAJOR EXPENDITURE ITEMS BY LEVEL OF INCOME",null,null,null,null,null,null,null,"ANNUAL MEAN EXPENDITURE"]
["Item","All\nconsumer\nunits","Lowest\n20\npercent","Second\n20\npercent","Third\n20\npercent","Fourth\n20\npercent","Highest\n20\npercent",null,null,null,null,null,null,null,"Bubbles",null,null,null,"Slope",null,null,null,null,null,"Consumer Expenditure Survey, 3rd quarter 2013 through 2nd quarter 2014",null,null,null,null,null,null,null,"Consumer Expenditure Survey, "]
["Number of consumer units (in thousands)",126420,25206,25337,25323,25341,25212,null,null,null,null,null,null,null,null,null,null,null,null,null,null,null,null,null,null,null,null,null,null,null,null,null,"3rd quarter 2013 through 2nd quarter 2014"]
["Lower limit","n.a.","n.a.",17890,35073,57829,96074,null,null,null,null,null,null,null,null,null,null,null,"Lowest 20%","Highest 20%","Lowest 20%","Highest 20%"]
["",null,null,null,null,null,null,null,null,null,null,null,null,null,"Y","Label","X","Size",{"$f":"SUM(S7:S20)","v":22982},{"$f":"SUM(T7:T20)","v":100979},{"$f":"SUM(U7:U20)","v":100.00000000000001},99.999999999999986]
["Consumer unit characteristics:",null,null,null,null,null,null,null,null,null,null,null,null,null,6665,"Food",0,1,3685,11261,{"$f":"S7/S$6*100","v":16.03428770342007},{"$f":"T7/T$6*100","v":11.151823646500759}]
["",null,null,null,null,null,null,null,null,null,null,null,null,null,450,"Alcoholic beverages",0,1,181,970,0.78757288312592455,0.96059576743679387]
["Income before taxes",null,null,null,null,null,null,null,null,null,null,null,null,null,17377,"Housing",0,1,9319,31034,40.549125402488905,30.733122728488098]
["Mean",64432,9818,26369,45724,74410,166048,null,null,null,null,null,null,null,1674,"Apparel and services",0,1,732,3339,3.1851013836915847,3.3066281107953137]
{"$rows_left_out":792}
{"sheet":"8.16-8.18","index":10,"n_rows":44,"n_cols":27,"rows_kept":44,"cut":false,"hidden":false,"merged":[]}
["This is a very simple speedometer using a donut chart. It displays"]
["the needle in the yellow range, but it can be be modified for",null,null,null,null,null,null,null,null,null,null,null,"Bullet charts"]
["displaying values in other ranges."]
[null,null,null,null,null,null,null,null,null,null,null,null,null,"Low"]
[null,null,null,null,null,null,null,null,null,null,null,null,null,1,0,null,2,0,null,3,0,null,4,0,null,5,0]
[{"$f":"+B6","v":180},180,180,180,180,180,180,null,null,null,null,null,null,1,{"$f":"RANDBETWEEN(40,60)","v":46},null,2,{"$f":"RANDBETWEEN(40,60)","v":50},null,3,{"$f":"RANDBETWEEN(40,60)","v":42},null,4,{"$f":"RANDBETWEEN(40,60)","v":53},null,5,{"$f":"RANDBETWEEN(40,60)","v":53}]
[60,60,60,60,60,60,60,null,null,null,null,null,null,"Average"]
[57,57,57,57,57,57,57,"-these must sum 60",null,null,null,null,null,1,{"$f":"+O6","v":46},null,2,{"$f":"+R6","v":50},null,3,{"$f":"+U6","v":42},null,4,{"$f":"+X6","v":53},null,5,{"$f":"+AA6","v":53}]
[2,2,2,2,2,2,2,"->needle",null,null,null,null,null,1,{"$f":"RANDBETWEEN(O8,O8+RANDBETWEEN(2,100))","v":68},null,2,{"$f":"RANDBETWEEN(R8,R8+RANDBETWEEN(2,100))","v":55},null,3,{"$f":"RANDBETWEEN(U8,U8+RANDBETWEEN(2,100))","v":80},null,4,{"$f":"RANDBETWEEN(X8,X8+RANDBETWEEN(2,100))","v":67},null,5,{"$f":"RANDBETWEEN(AA8,AA8+RANDBETWEEN(2,100))","v":101}]
[1,1,1,1,1,1,{"$f":"60-G8-G9","v":1},null,null,null,null,null,null,"High"]
{"$rows_left_out":35}
{"sheet":"US Regions","index":11,"n_rows":73,"n_cols":9,"rows_kept":73,"cut":false,"hidden":false,"merged":[]}
["Region 1: Northeast"]
["Division 1: New England (Connecticut"," Maine"," Massachusetts"," New Hampshire"," Rhode Island","Vermont"]
["Division 2: Mid-Atlantic (New Jersey"," New York","Pennsylvania"]
["Region 2: Midwest"]
["Division 3: East North Central (Illinois"," Indiana"," Michigan"," Ohio","Wisconsin"]
["Division 4: West North Central (Iowa"," Kansas"," Minnesota"," Missouri"," Nebraska"," North Dakota","South Dakota"]
["Region 3: South"]
["Division 5: South Atlantic (Delaware"," Florida"," Georgia"," Maryland"," North Carolina"," South Carolina"," Virginia"," Washington D.C."," West Virginia"]
["Division 6: East South Central (Alabama"," Kentucky"," Mississippi"," Tennessee"]
["Division 7: West South Central (Arkansas"," Louisiana"," Oklahoma"," Texas"]
{"$rows_left_out":63}