{"text_format":"1","workbook":"xlsx","n_sheets":11,"sheets":["15.5-15.6","15.7","15.10-15.11","15.12","15.16","15.17","15.18","15.20-15.22","15.21","15.23","15.24-15.29"],"not_rendered":{"charts":37,"images":0,"macros":0,"external_links":1,"defined_names":0,"comments":1,"pivot_tables":0},"unopened":[],"bounds":{"document_bytes":16777216,"sheet_cells":100000,"rows_first":2000,"rows_last":500,"rows_between":2000,"halvings":0,"cell_chars":16384,"cell_head_chars":4096},"cells_cut":0,"cells_raw":0,"read":"whole","date_system":"1900"}

{"sheet":"15.5-15.6","index":0,"n_rows":25,"n_cols":39,"rows_kept":25,"cut":false,"hidden":false,"merged":[[47,39,49,39],[47,40,49,40],[47,41,49,41],[47,32,49,32],[47,33,49,33],[47,34,49,34],[47,35,49,35],[47,36,49,36],[52,41,54,41],[52,42,54,42],[43,32,45,32],[43,33,45,33],[43,34,45,34],[43,35,45,35],[43,36,45,36],[43,37,45,37],[43,38,45,38],[43,39,45,39],[43,40,45,40],[43,41,45,41],[43,42,45,42],[47,42,49,42],[47,37,49,37],[47,38,49,38],[31,35,33,35],[31,36,33,36],[34,32,36,32],[34,37,36,37],[34,36,36,36],[34,33,36,33],[34,34,36,34],[34,35,36,35],[31,37,33,37],[31,38,33,38],[31,39,33,39],[31,40,33,40],[52,32,54,32],[52,33,54,33],[52,34,54,34],[52,35,54,35],[52,36,54,36],[52,37,54,37],[52,38,54,38],[52,39,54,39],[52,40,54,40],[31,32,33,32],[31,33,33,33],[31,34,33,34],[9,37,11,37],[9,38,11,38],[9,32,11,32],[9,33,11,33],[9,34,11,34],[9,35,11,35],[9,36,11,36],[2,11,4,11],[5,11,7,11],[8,11,10,11],[2,1,4,1],[2,21,4,21],[5,1,7,1],[5,21,7,21],[8,1,10,1],[8,21,10,21],[34,42,36,42],[34,41,36,41],[34,40,36,40],[34,39,36,39],[34,38,36,38],[14,32,16,32],[14,33,16,33],[14,34,16,34],[14,35,16,35],[14,36,16,36],[1,42,3,42],[1,32,3,32],[1,33,3,33],[1,34,3,34],[1,35,3,35],[1,36,3,36],[1,38,3,38],[1,39,3,39],[1,40,3,40],[1,41,3,41],[20,37,22,37],[20,38,22,38],[24,32,26,32],[24,33,26,33],[24,34,26,34],[24,35,26,35],[24,36,26,36],[24,37,26,37],[24,38,26,38],[20,32,22,32],[20,33,22,33],[20,34,22,34],[20,35,22,35],[20,36,22,36]]}
[null,"Pure colors",null,null,null,null,null,null,null,null,null,"Less saturation",null,null,null,null,null,null,null,null,null,"Adjusted hues",null,null,null,null,null,null,null,null,null,null,"Ordered by luminance",null,null,null,null,null,"Ordered by hue"]
[]
[]
[]
[]
[]
[]
[]
[]
[null,null,null,null,null,null,null,null,null,null,null,null,null,null,null,null,null,null,null,null,null,null,null,null,null,null,null,null,null,null,null,null,32,64,96,128,160,192,224]
[]
[]
[]
[]
[]
{"$rows_left_out":11}
{"sheet":"15.7","index":1,"n_rows":79,"n_cols":38,"rows_kept":79,"cut":false,"hidden":false,"merged":[[71,0,71,32],[73,0,73,32],[5,0,6,2],[77,0,77,32],[0,0,0,32],[5,24,5,26],[5,27,5,29],[5,30,5,32],[5,15,5,17],[5,21,5,23],[5,9,5,11],[5,3,5,5],[5,6,5,8],[5,12,5,14],[5,18,5,20]]}
["Table  A-2.  Percent of People 25 Years and Over Who Have Completed High School or College, by Race, Hispanic Origin and Sex:  Selected Years 1940 to 2014"]
["(Noninstitutionalized population)"]
[]
["Get the data:",null,null,"https://goo.gl/ZExOBX"]
[]
["Age and Year",null,null,"ALL RACES",null,null,"WHITE",null,null,"NON-HISPANIC WHITE",null,null,"BLACK /5",null,null,"ASIAN",null,null,"HISPANIC\n(OF ANY RACE)",null,null,"WHITE ALONE OR IN COMBINATION",null,null,"NON-HISPANIC WHITE ALONE OR IN COMBINATION",null,null,"BLACK ALONE OR IN COMBINATION",null,null,"ASIAN ALONE OR IN COMBINATION"]
[null,null,null,"Total","Male","Female","Total","Male","Female","Total","Male","Female","Total","Male","Female","Total","Male","Female","Total","Male","Female","Total","Male","Female","Total","Male","Female","Total","Male","Female","Total","Male","Female"]
[]
["25 TO 29 YEARS OLD"]
[]
[null,"Completed 4 Years of College or more"]
[null,null,2014,34,30.9,37.200000000000003,34.799999999999997,31.6,38.200000000000003,40.799999999999997,37.700000000000003,43.9,21.5,19.5,23.4,61.7,56.3,66.5,15.1,12.4,18.3,34.5,31.2,38,40.6,37.4,43.8,21.4,18.7,23.9,60,54.4,65.3,"2014-12-31",null,null,null,"AFTER MORE THAN 30 YEARS, ARE MEN PLAYING CATCH-UP IN EDUCATION?"]
[null,null,2013,33.6,30.2,37,34.299999999999997,30.8,37.9,40.4,37.1,43.8,20.100000000000001,16.8,23.1,59,54.3,63.2,15.7,13.1,18.600000000000001,34.1,30.6,37.700000000000003,40.1,36.799999999999997,43.5,19.8,16.600000000000001,22.8,58.1,53.7,62.2,"2013-12-31",null,null,null,"People aged 25 years and over who have completed college"]
[null,null,2012,33.5,29.8,37.200000000000003,33.700000000000003,29.9,37.6,39.799999999999997,36,43.6,22.7,18.5,26.2,60.8,56.8,64.5,14.8,12.5,17.399999999999999,33.5,29.8,37.4,39.6,35.9,43.4,22.8,18.100000000000001,27,59.6,55.7,63.4,"2012-12-31"]
[null,null,2011,32.200000000000003,28.4,36.1,33.1,29.2,37.4,39.200000000000003,35.5,43,19.600000000000001,16.100000000000001,22.8,56.2,51.5,60.6,12.8,9.6,16.8,33,29,37.1,39,35.4,42.7,19.8,16.3,22.9,55.7,52,59.1,"2011-12-31"]
{"$rows_left_out":65}
{"sheet":"15.10-15.11","index":2,"n_rows":83,"n_cols":12,"rows_kept":83,"cut":false,"hidden":false,"merged":[]}
["Healthy Life Years (from 2004 onwards) [hlth_hlye]",null,null,null,null,null,null,null,null,null,null,"IN MOST COUNTRIES, WOMEN ENJOY A LONGER AND HEALTHIER LIFE THAN MEN"]
[null,null,null,null,null,"Get the data: ",null,"http://goo.gl/2wbAsv",null,null,null,"Large gap in life expectancy at birth in Eastern Europe"]
["Last update","2014-10-08T16:45:03"]
["Extracted on","2014-10-23T16:41:15.565"]
["Source of data","Eurostat"]
[null,null,"Female","Males","Females","Males"]
["GEO","TIME/INDIC_HE","Healthy life years in absolute value at birth - females","Healthy life years in absolute value at birth - males","Life expectancy in absolute value at birth - females","Life expectancy in absolute value at birth - males"]
["EU-28","2012",62.1,61.5,83.1,77.5]
["Bélgica","2012",65.400000000000006,64.3,83.1,77.8]
["Bulgária","2012",65.7,62.1,77.900000000000006,70.900000000000006]
["Rep. Checa","2012",64.099999999999994,62.3,81.2,75.099999999999994]
["Dinamarca","2012",61.4,60.6,82.1,78.099999999999994]
["Alemanha","2012",57.9,57.4,83.3,78.599999999999994]
["Estónia","2012",57.2,53.1,81.5,71.400000000000006]
["Irelanda","2012",68.5,65.900000000000006,83.2,78.7]
{"$rows_left_out":69}
{"sheet":"15.12","index":3,"n_rows":69,"n_cols":23,"rows_kept":69,"cut":false,"hidden":false,"merged":[]}
["Structure of consumption expenditure by income quintile (COICOP level 2) (1 000) [hbs_str_t223]"]
[]
["Last update","2015-03-13T07:35:37"]
["Extracted on","2016-04-17T17:22:48.981"]
["Source of data","Eurostat"]
["GEO","Spain"]
["Get the data:",null,"http://goo.gl/pFMKdb"]
[null,null,null,null,null,null,null,null,null,null,null,null,null,null,null,null,null,null,"LESS IN FOOD, MORE IN HOUSING: CHANGES IN EXPENDITURE IN SPAIN"]
["QUANTILE","COICOP/TIME","1988","2010",null,null,null,null,null,null,null,null,null,null,null,null,null,null,"Proportion of household expenditure per category and income quintile"]
["First quintile","Food and non-alcoholic beverages",346.3,190,null,null,null,null,1998]
["First quintile","Alcoholic beverages, tobacco and narcotics",31.5,26,null,null,null,null,null,null,null,"Q1","Q2","Q3","Q4","Q5",null,null,null,"1988",null,null,"2010"]
["First quintile","Clothing and footwear",102.1,49,null,null,null,null,"alcoholic beverages","Food and non-","Food and non-alcoholic beverages",34.630000000000003,31.04310431,28.192819279999998,25.22747725,19.46]
["First quintile","Housing, water, electricity, gas and other fuels",171.1,363,null,null,null,null," tobacco, and narcotics","Alcoholic beverages,","Alcoholic beverages, tobacco and narcotics",3.15,2.590259026,2.660266027,2.2897710230000001,1.77]
["First quintile","Furnishings, household equipment and routine household maintenance",59,41,null,null,null,null,null,"Clothing and footwear","Clothing and footwear",10.210000000000001,10.57105711,10.561056110000001,10.88891111,10.77]
["First quintile","Health",20.2,27,null,null,null,"and other fuels"," electricity, gas, ","Housing, water, ","Housing, water, electricity, gas and other fuels",17.11,18.391839180000002,18.591859190000001,18.988101189999998,20.66]
{"$rows_left_out":55}
{"sheet":"15.16","index":4,"n_rows":13,"n_cols":4,"rows_kept":13,"cut":false,"hidden":false,"merged":[]}
[null,1,2,3]
[null,{"$f":"getRGB3($A2,B$1)","v":204},{"$f":"getRGB3($A2,C$1)","v":0},0]
[null,{"$f":"getRGB3($A3,B$1)","v":255},104,1]
[null,255,153,51]
[null,255,204,102]
[null,255,222,155]
[null,204,236,255]
[null,153,204,255]
[null,102,153,255]
[null,51,102,255]
[null,0,51,204]
[null,255,255,255]
[null,217,217,217]

{"sheet":"15.17","index":5,"n_rows":48,"n_cols":21,"rows_kept":48,"cut":false,"hidden":false,"merged":[]}
["Frequency of being happy in the last 4 weeks by age, sex and educational attainment level [ilc_pw08]"]
[]
["Last update","2016-03-31T12:29:08"]
["Extracted on","2016-04-17T17:39:53.972"]
["Source of data","Eurostat"]
[]
["UNIT","Percentage"]
["ISCED11","All ISCED 2011 levels "]
["TIME","2013"]
["AGE","16 years or over"]
[]
["Get the data:",null,"http://goo.gl/i6rZK1"]
[]
[null,null,null,null,null,null,null,null,"Left side","Left side",null,"Right side","Right side",null,"Positive-",null,"Split \"Sometimes\"",null,null,null,"FREQUENCY OF BEING HAPPY IN THE LAST 4 WEEKS"]
["SEX","GEO/FREQUENC","Always","Most of the time","Sometimes","Rarely","Never",null,"Always","Most of the time","Sometimes","Rarely","Never","Sum Positive","Negative","Alarm","Left","Right",null,null,"Population over 16 years old in 2013"]
{"$rows_left_out":34}
{"sheet":"15.18","index":6,"n_rows":52,"n_cols":59,"rows_kept":52,"cut":false,"hidden":false,"merged":[[49,6,49,8],[49,16,49,18],[49,21,49,23],[49,11,49,13],[13,1,13,4],[13,5,13,8],[13,9,13,12],[13,13,13,16],[13,17,13,20],[13,21,13,24],[13,57,13,59],[49,26,49,28],[49,31,49,33],[49,36,49,38],[49,41,49,43],[49,46,49,49],[13,49,13,52],[13,53,13,56],[13,25,13,28],[13,29,13,32],[13,33,13,36],[13,37,13,40],[13,41,13,44],[13,45,13,48]]}
["Exports and imports by Member States of the EU/third countries - Current prices [namq_exi_c]"]
[]
["Last update","2014-09-26T20:05:55"]
["Extracted on","2014-11-03T16:26:51.813"]
["Source of data","Eurostat"]
[null,"Exports of goods and services"]
["S_ADJ","Seasonally adjusted and adjusted data by working days"]
["UNIT","Percentage of GDP"]
["INDIC_NA"]
[]
[{"$f":"UPPER(B6)&\" \"&UPPER(B8)","v":"EXPORTS OF GOODS AND SERVICES PERCENTAGE OF GDP"}]
[{"$f":"B7","v":"Seasonally adjusted and adjusted data by working days"}]
[null,null,null,null,null,null,null,null,null,null,null,null,null,null,null,null,null,null,null,null,null,null,null,null,null,null,null,null,null,null,null,null,null,null,null,null,null,null,null,null,null,null,null,null,null,null,null,null,null,null,null,null,null,null,"Year - Quarter"]
[null,2000,null,null,null,2001,null,null,null,2002,null,null,null,2003,null,null,null,2004,null,null,null,2005,null,null,null,2006,null,null,null,2007,null,null,null,2008,null,null,null,2009,null,null,null,2010,null,null,null,2011,null,null,null,2012,null,null,null,2013,null,null,null,2014]
["Country","1","2","3","4","1","2","3","4","1","2","3","4","1","2","3","4","1","2","3","4","1","2","3","4","1","2","3","4","1","2","3","4","1","2","3","4","1","2","3","4","1","2","3","4","1","2","3","4","1","2","3","4","1","2","3","4","1","2"]
{"$rows_left_out":38}
{"sheet":"15.20-15.22","index":7,"n_rows":24,"n_cols":21,"rows_kept":24,"cut":false,"hidden":false,"merged":[]}
[null,"AGE","From 15 to 64 years"]
[null,"UNIT","Percentage"]
[null,"TIME","2014"]
[null,"GEO","European Union (28 countries)",null,null,null,null,null,null,null,null,null,null,null,null,null,null,null,null,null,"MAIN REASONS FOR PART-TIME EMPLOYMENT BY SEX"]
[null,null,null,null,null,null,null,null,null,null,"MAIN REASONS FOR PART-TIME EMPLOYMENT BY SEX",null,null,null,null,null,null,null,null,null,"From 15 to 64 years old, in the European Union (EU-28), in 2014"]
[null,"REASON/SEX","Total","Males","Females",null,null,null,null,null,"From 15 to 64 years old, in the European Union (EU-28), in 2014"]
[1,"Could not find a full-time job",29.6,40.200000000000003,26.3]
[2,"Looking after children or incapacitated adults",21.7,4.2,27.1]
[3,"Other family or personal responsibilities",13.2,7.3,15.1]
[4,"In education or training",10.3,19.100000000000001,7.5]
[5,"Own illness or disability",4.0999999999999996,6.4,3.4]
[6,"Other reasons",21.1,22.8,20.6]
[]
[null,"MAIN REASONS FOR PART-TIME EMPLOYMENT BY SEX"]
[null,"Main reason for part-time employment - Distributions by sex and age (%) [lfsa_epgar]"]
{"$rows_left_out":10}
{"sheet":"15.21","index":8,"n_rows":47,"n_cols":17,"rows_kept":47,"cut":false,"hidden":false,"merged":[]}
["Get the data:",null,"Page:","http://goo.gl/U3BmPT",null,null,"XLS:","http://goo.gl/PI6pkA"]
[]
[null,"Cheddar","Other American","Provolone","Romano","Parmesan","Mozzarella","Ricotta","Swiss","Brick","Muenster","Blue","Other"]
[1970,5.790657979439362,1.2046358972358229,0.22712639962669892,0.14910784666438678,0.16566344773604202,1.187641146432578,0.24125873399187436,0.88442842763816221,0.10120936984486377,0.17048115057809485,0.1465481926535708,0.40875191437699598]
[1971,5.9052205276869518,1.4168476507384633,0.21829384503375793,0.14257712110580889,0.19667948113264463,1.3795091878279753,0.2786032764273243,0.93732081852342963,0.1075921200649276,0.19106322208738141,0.15129947366140006,0.40669921014815874]
[1972,6.0069367686854447,1.6696602126767539,0.23942521727364821,0.15941974469614331,0.22919668461677986,1.5709443207631146,0.31057968131169195,1.0608569360465856,0.10338884161830039,0.21700686723576568,0.16936482829591798,0.55574465884673696]
[1973,6.0727293319302156,1.7585331439438627,0.26633004678544647,0.1542689594746586,0.18443111229453715,1.7631357833323695,0.33875986000573849,1.0554004578980993,0.1087657862327121,0.21493933455659492,0.17865687630067625,0.64723690352037289]
[1974,6.3068542089462882,2.159679033359208,0.27229438394306849,0.1506567165405758,0.25155524584264438,1.8577682893449188,0.33202859760700737,1.1793431761707831,0.10978406283836296,0.22679536277162771,0.16208254229521074,0.61031291650968678]
[1975,6.0377639797567282,2.1094581267102832,0.27715902861137742,0.15801254873259798,0.23583975381039449,2.1114704809020273,0.37498609906698516,1.0927801724004418,9.0398063845209958E-2,0.24033252415132889,0.1597699712464058,0.57222516667485634]
[1976,6.4478271837090366,2.4352787396518911,0.31399614067373,0.17043314941447063,0.27416398894201865,2.3113324171168044,0.40522071156742206,1.248143960598453,8.8083700916774976E-2,0.25313312055482512,0.18384663012819044,0.53115726752657166]
[1977,6.7978014793020316,2.4152034834883929,0.34489330496575499,0.15523541500219287,0.26221713149755271,2.46441643359175,0.4062401605861905,1.2113189093757371,7.1966296066378319E-2,0.2510417424121999,0.18060379860061115,0.54774294515874167]
[1978,6.9390210481389127,2.586337803535729,0.3620110424919652,0.18009281653166639,0.2761947780727278,2.6804884266231568,0.44030914171957314,1.3342776160267498,7.5526941728743247E-2,0.26533966088710231,0.19025091538064109,0.51152333104466596,null,null,null,"MOZZARELLA IS WINNING THE WAR AGAINST CHEDDAR"]
[1979,6.929977116704805,2.667228010930661,0.40090260309728032,0.15958749295973454,0.31896665957174442,2.8012913966886996,0.4612291800037277,1.3520153790458977,6.3617970432286813E-2,0.28132100918791764,0.17874741729799382,0.52881910985141867,null,null,null,"Cheese: Per capita availability adjusted for loss"]
[1980,6.8428594012102266,2.7772805915881364,0.41773935410439544,0.14695514403948712,0.27830345545985435,3.0083019229479193,0.46637166479405945,1.3241406490747607,6.7163776058147537E-2,0.30574743876284921,0.16837339609882049,0.62359181560408428]
[1981,7.0328918187906035,3.1175782506979286,0.4450521050786207,0.14038776532486835,0.30329556074963709,2.9634827631236811,0.48816636726167983,1.2693804547159131,6.004726693662335E-2,0.29144861317077475,0.158779993564266,0.7797050314538676]
{"$rows_left_out":33}
{"sheet":"15.23","index":9,"n_rows":37,"n_cols":24,"rows_kept":37,"cut":false,"hidden":false,"merged":[]}
[]
[null,0,10,20,30,40,50,60,70,80,90,100,null,null,null,"Triadic","Analogue","Complementary","split complementary","Triadic","Analogue"]
["Red-Orange",1,1,1,1,1,1,1,1,1,1,1,1,1,1,13,150,30,120,30,30,30,150,30]
["Orange",1,1,1,1,1,1,1,1,1,1,1,1,1,1,4,30,30,30,30,30,30,180,30]
["Orange-Yellow",1,1,1,1,1,1,1,1,1,1,1,1,1,1,116,30,0,30,90,30,30,null,150]
["Yellow",1,1,1,1,1,1,1,1,1,1,1,1,1,1,4,30,0,30,30,0,90,null,30]
["Yellow-Green",1,1,1,1,1,1,1,1,1,1,1,1,1,1,116,0,0,120,90,0,30,null,30]
["Green",1,1,1,1,1,1,1,1,1,1,1,1,1,1,4,0,150,30,30,0,30,null,30]
["Green-Blue",1,1,1,1,1,1,1,1,1,1,1,1,1,1,0,0,30,0,60,0,30]
["Blue",1,1,1,1,1,1,1,1,1,1,1,1,1,1,0,0,0,0,0,0]
["Blue-Violet",1,1,1,1,1,1,1,1,1,1,1,1,1,1,0,0,0,0,0,0]
["Violet",1,1,1,1,1,1,1,1,1,1,1,1,1,1,0,0,0,0,0,0]
["Violet-Red",1,1,1,1,1,1,1,1,1,1,1,1,1,1,0,0,0,0,0,0]
["Red-Orange",1,1,1,1,1,1,1,1,1,1,1,1,1,1,{"$f":"360-SUM(P3:P13)","v":103},120,120,0,0,270,90,30,60]
[]
{"$rows_left_out":23}
{"sheet":"15.24-15.29","index":10,"n_rows":47,"n_cols":98,"rows_kept":47,"cut":false,"hidden":false,"merged":[]}
[]
[]
[null,null,null,null,"United States"]
[null,null,"Males","Females","Total",null,null,null,null,null,null,"Complementary",null,null,null,null,null,null,null,null,null,null,null,null,null,null,null,null,null,"Split complementary",null,null,null,null,null,null,null,null,null,null,null,null,null,null,null,null,null,null,"Triadic",null,null,null,null,null,null,null,null,null,null,null,null,null,null,null,null,null,null,null,"Analogue",null,null,null,null,null,null,null,null,null,null,null,null,null,null,null,null,null,null,null,"Rectangle",null,null,null,null,null,null,null,null,"Warm/cool"]
[2002,{"$f":"A5&\"M12\"","v":"2002M12"},{"$f":"INDEX([1]!Table19[TotalHomens],MATCH(\"United States\"&B5,[1]!Table19[Chave],0))","v":6.2},{"$f":"INDEX([1]!Table19[TotalMulheres],MATCH(\"United States\"&B5,[1]!Table19[Chave],0))","v":5.7},{"$f":"INDEX([1]!Table19[Total],MATCH(\"United States\"&B5,[1]!Table19[Chave],0))","v":6},{"$f":"INDEX([1]!Table19[TotalHomens],MATCH(\"United States\"&B5,[1]!Table19[Chave],0))","v":6.2},{"$f":"INDEX([1]!Table19[TotalMulheres],MATCH(\"United States\"&B5,[1]!Table19[Chave],0))","v":5.7}]
[{"$f":"+A5+2","v":2004},"2004M12",{"$f":"INDEX([1]!Table19[TotalHomens],MATCH(\"United States\"&B6,[1]!Table19[Chave],0))","v":5.5},{"$f":"INDEX([1]!Table19[TotalMulheres],MATCH(\"United States\"&B6,[1]!Table19[Chave],0))","v":5.0999999999999996},{"$f":"INDEX([1]!Table19[Total],MATCH(\"United States\"&B6,[1]!Table19[Chave],0))","v":5.4},{"$f":"INDEX([1]!Table19[TotalHomens],MATCH(\"United States\"&B6,[1]!Table19[Chave],0))","v":5.5},{"$f":"INDEX([1]!Table19[TotalMulheres],MATCH(\"United States\"&B6,[1]!Table19[Chave],0))","v":5.0999999999999996}]
[2006,"2006M12",{"$f":"INDEX([1]!Table19[TotalHomens],MATCH(\"United States\"&B7,[1]!Table19[Chave],0))","v":4.5},{"$f":"INDEX([1]!Table19[TotalMulheres],MATCH(\"United States\"&B7,[1]!Table19[Chave],0))","v":4.4000000000000004},{"$f":"INDEX([1]!Table19[Total],MATCH(\"United States\"&B7,[1]!Table19[Chave],0))","v":4.4000000000000004},{"$f":"INDEX([1]!Table19[TotalHomens],MATCH(\"United States\"&B7,[1]!Table19[Chave],0))","v":4.5},{"$f":"INDEX([1]!Table19[TotalMulheres],MATCH(\"United States\"&B7,[1]!Table19[Chave],0))","v":4.4000000000000004}]
[2008,"2008M12",{"$f":"INDEX([1]!Table19[TotalHomens],MATCH(\"United States\"&B8,[1]!Table19[Chave],0))","v":8},{"$f":"INDEX([1]!Table19[TotalMulheres],MATCH(\"United States\"&B8,[1]!Table19[Chave],0))","v":6.5},{"$f":"INDEX([1]!Table19[Total],MATCH(\"United States\"&B8,[1]!Table19[Chave],0))","v":7.3},{"$f":"INDEX([1]!Table19[TotalHomens],MATCH(\"United States\"&B8,[1]!Table19[Chave],0))","v":8},{"$f":"INDEX([1]!Table19[TotalMulheres],MATCH(\"United States\"&B8,[1]!Table19[Chave],0))","v":6.5}]
[2010,"2010M12",{"$f":"INDEX([1]!Table19[TotalHomens],MATCH(\"United States\"&B9,[1]!Table19[Chave],0))","v":10},{"$f":"INDEX([1]!Table19[TotalMulheres],MATCH(\"United States\"&B9,[1]!Table19[Chave],0))","v":8.5},{"$f":"INDEX([1]!Table19[Total],MATCH(\"United States\"&B9,[1]!Table19[Chave],0))","v":9.3000000000000007},{"$f":"INDEX([1]!Table19[TotalHomens],MATCH(\"United States\"&B9,[1]!Table19[Chave],0))","v":10},{"$f":"INDEX([1]!Table19[TotalMulheres],MATCH(\"United States\"&B9,[1]!Table19[Chave],0))","v":8.5}]
[2012,"2012M12",{"$f":"INDEX([1]!Table19[TotalHomens],MATCH(\"United States\"&B10,[1]!Table19[Chave],0))","v":7.9},{"$f":"INDEX([1]!Table19[TotalMulheres],MATCH(\"United States\"&B10,[1]!Table19[Chave],0))","v":7.9},{"$f":"INDEX([1]!Table19[Total],MATCH(\"United States\"&B10,[1]!Table19[Chave],0))","v":7.9},{"$f":"INDEX([1]!Table19[TotalHomens],MATCH(\"United States\"&B10,[1]!Table19[Chave],0))","v":7.9},{"$f":"INDEX([1]!Table19[TotalMulheres],MATCH(\"United States\"&B10,[1]!Table19[Chave],0))","v":7.9}]
[2014,"2014M12",{"$f":"INDEX([1]!Table19[TotalHomens],MATCH(\"United States\"&B11,[1]!Table19[Chave],0))","v":5.8},{"$f":"INDEX([1]!Table19[TotalMulheres],MATCH(\"United States\"&B11,[1]!Table19[Chave],0))","v":5.3},{"$f":"INDEX([1]!Table19[Total],MATCH(\"United States\"&B11,[1]!Table19[Chave],0))","v":5.6},{"$f":"INDEX([1]!Table19[TotalHomens],MATCH(\"United States\"&B11,[1]!Table19[Chave],0))","v":5.8},{"$f":"INDEX([1]!Table19[TotalMulheres],MATCH(\"United States\"&B11,[1]!Table19[Chave],0))","v":5.3}]
[2016]
[]
[null,null,"Germany (until 1990 former territory of the FRG)","Spain","Greece","United States"]
[null,null,"Germany","Spain","Greece","France"]
{"$rows_left_out":32}